Node failed to compile module not found

node failed to compile module not found In order to do that it basically has two important steps: Configuring & building. Developers TS Node exports a create() function that can be used to initialize a TypeScript compiler that isn't registered to require. 0" ,after delete/backspace you save,and then run npm i --unsafe-perm,run againt npm i bcrypt --unsape-perm, its work for me,i hope this solved guys. js I found this: import { platform, release } from 'os'; The os module is a built-in Node. [ 19. js app heroku, When I tried to push my nodejs app to heroku with git push heroku master , i got this: Counting objects: 975, done. js' About can not find module 'e: \ applications \ node_modules \ npm \ bin \ node_modules \ npm \ bin \ npm . The implementation is not complete, but work is continuing and you can join the fun at the project's SourceForge page . js file $ cp ~/dev/pty. false Node. . 4. For example, let's try to import the Beautifulsoup4 library that's not installed in my virtual environment. Note: node module resolution is the most-commonly used in the TypeScript community and is recommended for most projects. / node_modules / browserify-zlib / lib / index. 8. Step 1: Update tsconfig. for someone who get problem on same. Module not found: Error: Cannot resolve module 'fs' TypeError: fs. Pastebin. Excluding it from installation. This is what is referred to by most members of the Drupal community as the White Screen of Death or WSOD. js Module not found: Can 't resolve ' util ' in ' E:\s ourcecode \f rontend \A ppDev-web \n ode_modules \b rowserify-zlib \l ib ' I'm not explicit import browserify-zlib , so I search it in project, in yarn. 10. npm ERR! Make sure you have the latest version of node. However, to run a Node. Let us combine the two, and serve the file requested by the client. The TX node did not receive an ACK from the RX node, so it attempts to resend. We need to install Cython package depending on the version of Python installed on the system as below: #pip3. The cause. $ tar -xzvf node-v0. And furthermore: $ npm zsh: command not found: npm I thought npm was included in NodeJS > 0. I don't understand why the node command will not work, whereas nodejs works: $ node --version zsh: command not found: node $ nodejs --version v0. tar. 6. In Mathscript window: Module not found: Can't resolve 'uuid/v4' in 'C:\Users\username\reactnative\src'" so can anyone help me fix this error? And also there are no other errors in the code and it's exactly the same as shown in the video! Module build failed: BrowserslistError: F:\WEB\HBuilder\app\travelApp contains both browserslist and package. ”-ForegroundColor Red } $jsonResponse = ConvertFrom-Json $response. js in a short presentation that can be found on the Node. I can confirm that this was a problem with my situation. I had to remove all dependencies (including clearing the npm cache), install electron and electron-rebuild, reinstall all dependencies, then run electron-rebuild against electron v6 (in my case, it was NODE_MODULE_VERSION 73, the one used by Pre-built binaries not found for [email protected] Hi All, I’m new to ionic, so I’m not even sure this is the right place to post this. For example, the calls atom_to_list(erlang) and erlang:atom_to_list(erlang) are identical. npm tracks the modules installed in a project with the package. jsが見つからないようなのですがディレクトリを見たら普通にあるので困っています。どうかご享受お願いします。 &lt;s&gt; [webpack. x, 14. If not specified, the default is Node for --module commonjs, and Classic otherwise (including when --module is set to amd, system, umd, es2015, esnext, etc. css to index. For example, you could remember the last packet# sent to the DB, and only send a new packet if the packet# is higher than previously sent. In your Automation account, click State configuration (DSC) under Configuration Management. x and 10. 7. js Foundation’s Case Studies page. 6 install --user` instead. Module based coding eases the effort for maintenance and increases reusability. Before compiling, check that your local Node. js application though the ts-node executable (instead of the node executable), a TypeScript wrapper is registered with the "require" module to load the . This single source file is all that is needed to generate a shared library that can be loaded into a standard tclsh or wish using the TCL load command , or to generate a standalone Using node v11. With my Device A it works Device B not works (no data in or out), but i have no idea why. But I got some problem, although Node and NPM installed I did uninstall and again installed for some reasons. / src / App. js Module not found: Can't resolve 'react-router-dom'. js application. Exit status 1 npm ERR! npm ERR! Failed at the [email protected] js Package Manager (npm) is the default and most popular package manager in the Node. 我在网上找寻各种解决办法. Also, you can get the issue if you are trying to import a module of a library which not installed in your virtual environment. #sudo npm install -g nodemon. If no module is found and the MODULE option is not given the command proceeds to Config mode. JS Error: This relative module was not found October 20, 2019 by Ashley I was making an update to a small Vue. Create two html files and save them in the same folder as your node. global. Can I use Node modules already written in the CommonJS module format? § 2 Yes! The Node adapter for RequireJS, called r. However, managing dependencies between modules is a major concern developers face throughout the application A module that extends the Node. The compiler will not compile a project if a tsconfig file is absent. If you can’t find the problem, start modifying the new app until you either reproduce the problem or figure out what’s wrong with your real app. lib from Electron and not Node. js API. 1. 12:47:56 PM: info [email protected] nodemon: A handy tool for running Node. Running the 'npm install --save dns module' command will result in the 'dns' and 'module' modules being installed, with 72 'vulnerabilities' (read errors). Some points to be considered when using this approach: Shouldn't not put any sensitive data in here as it is visible to everyone and you can't ignore package. 15 I tried apt-get install nodejs, but the latest version is already installed. How to use the Webpack and Webpack Dev Server Node. com is the number one paste tool since 2002. 0. – hugo der hungrige May 15 '20 at 16:49 Add a comment | Failed to Compile, ReactJS does not find the module @uifabric/icons and it is looking in the directory node_modules/office-ui-fabric-react/lib, this error crashes the reactJS application. I am trying to used modbus to communicate from a wago plc to Node-red I can not install the modbus anything on the palette. What has to be done in those steps is described in the binding. First of all, we have to declare the path aliases in our tsconfig file. This will instruct Babel to use the preset-env plugin which will maximise our cross-browser compatibility. js execution environemnt. node[[X]. 8. Have fun, Blorkfish The node in the compile has no parent node - this is very rare, but will most likely be caused by vertex manipulation errors passing through hammers safe guard. Node. js runtime. 10. js files must be initiated in the "Command Line Interface" program of your computer. If it turns out your issue is a bug in Node. 16. This happens sometimes, It could happen after updating a module, theme, or Drupal core. js construct, which is not available in the browser. svg' {const content: any; export default content;} Here we declare a new module for SVGs by specifying any import that ends in . Node. " There are a few known issues about Description. For other platforms, see the platform documentation. 12:47:56 PM: info "[email protected] js and npm is with the Homebrew package manager, which means first you will need to install Homebrew on the Mac first if you have not done so already. When I checked the source code of get-user-agent. scss Dismiss Join GitHub today. This is why I was trying to compile from source to begin with. 首先. But, by running your Node. nodejs vue. Eventually I gave up on a clean repair and wiped my ubuntu install. Sera, thanks for the reply. x" instead of 8. 0 (node-v48 ABI, glibc) (falling back to source compile with node-gyp) [ERROR] gyp WARN EACCES user "root" does not have permission to access the dev dir "/root/. gz $ cd node-v0. System administrators can use Node. Please report any issues you encounter to the package maintainer. 6 install Cython WARNING: Running pip install with root privileges is generally not a good idea. Details about running and debugging Node. bashrc and they even have such package by name command-not-found… and I was able to replace it with desired content… so, is there a Functions in the shell which are not prefixed by a module name are assumed to be functional objects (Funs), built-in functions (BIFs), or belong to the module user_default or shell_default. js installation has matching architecture and the version is as close as possible to the one used in Azure (the current values can be checked on runtime from properties process. js Instantiating http://localhost/APP/node_modules/@fullcalendar/core/main. It is also commonly used to install a wide range of CLI tools and run project scripts. 0. The specified module could not be found. js. js source code. Here are some screenshots: The text was updated successfully, but these errors were encountered: I use node-gyp to compile the module, and provide the library path, and it compiles without errors. scss files to css at incredible speed and automatically via a connect middleware. To solve the Module Not found Error you can try compiling and migrating the contract using the following command: $ truffle compile $ truffle migrate Failed to Compile React Module not found you attempted to import which falls outside of the project src/ directory. I read in a few places that ts-node is not the way to go to deploy to Heroku, so I am not sure what to do. Generated code performance was poor (though almost 7x faster than the original Python) and the file size was rather large. js functionality is not available; You can use native addons; What is a native addon? Node. 14. hdbcds ). Module not found: Error: Can’t resolve ‘sass-loader’ in ‘F:\H5\project-h5’ Error: Module did not self-register npm install Error: gyp verb `which` failed Error: not found: python Browserify is elegant and fast. Which version of NodeJS is required for jitsi-meet and lib-jitsi-meet repos? Firstly I worked only with jitsi-meet repo and NodeJS 12. 还得靠自己解决. js via package manager. I created the MTA project in Web IDE for SAP HANA then I created one DB module and inside the DB module I created one HDB CDS Artifact( SLCDS2. js app heroku Push rejected, failed Exit status 1 npm ERR! npm ERR! Failed at the [email protected] The result is a new amalgamated source file called " tclsqlite3. Failed to compile . npm ERR! This is probably not a problem with npm. How to open the command line interface on your computer depends on the operating system. But what can i error: User modify failed Cannot modify user on this node: OS=FreeBSD: Command not found. To include private shell commands, define them in a module user_default and add the following argument as the first line in the . While VS Code does not include a built-in TypeScript linter, TypeScript linter extensions available in the marketplace. There is likely additional logging output above. 这个“Module not found: Can’t resolve ‘antd/dist’”报错的 Hey guys, I'm a front end developer (html/css/js mainly), and I wanted to dive into node/angular. js® is a JavaScript runtime built on Chrome's V8 JavaScript engine. js’. js:189:15 Use npm install --save-dev node-sass or npm rebuild node-sass --force. Build hangs after `Failed to compile. I use docker:17. The same concept applies to other assets including CSS, SCSS, JSON and more. Content return $jsonResponse} You need to replace Uri parameter with your_pull_ server_ URI. /src/App. version). Aside from dealing with long-running tasks, this module can also interface with the OS and run shell commands. To install, first make sure you have a working copy of the latest stable version of Node. js itself, the maintainer will report the issue upstream. 6. Can someone help me with this. js on your machine, not against the Node. js is the runtime and npm is the Package Manager for Node. I am a huge fan of XML and XPath, but I didn't want to write an XPath query analyzer if I could find a good one on the web. The given script will be processed through the shell environment on the remote node. However, thes exceptions are not limited to the fs module of Node. 15. js server makes your app available to serve HTTP requests. module this is the file location For compiling and installation on Windows, see Using Apache HTTP Server with Microsoft Windows and Compiling Apache for Microsoft Windows. UPDATE: I think I am supposed to compile it, so I tried: 4. Visual Studio Code has support for the JavaScript and TypeScript languages out-of-the-box as well as Node. json This documentation indicates what arguments a method accepts, the return value of that method, and what errors may be related to that method. React-router-dom has been added to the dependencies in npm and so has react-router and react. Hi. We use cookies to give you the best experience on our website. If you have ever done unclean reboots - this is harmless. This module does not require python on the remote system, much like the ansible. Pastebin. Tip: You can also run the program using VS Code's Run/Debug feature. js’ the extension of the file is still ‘hello. Name CRC failed on node at 0x00b620c8: Read 0x640c8ca3, calculated 0x795111fe or similar message about CRC failures. node-addon-api is an NPM module that provides napi. js Server Did you know that there are multiple ways to start a Node. Project has been created using the create-react-app myapp cmd line. We decided to compile our own NodeJS version with this fix backported into it. npm" before installing npm. Compile the C library and all other parts of the glibc package (including the threading and math libraries, NSS modules, and transliteration modules) using the GCC -fstack-protector, -fstack-protector-strong or -fstack-protector-all options to detect stack overruns. right after node_zlib) # NODE_EXT_LIST_ITEM(node_pty) # Copy the pty. Only the dynamic linker and a small number of routines called directly from The TCL interface for SQLite is a small module that is added into the regular amalgamation. 0 start /root/gateway webpack && node build/gateway. Using node. The Library not installed. Node. You can follow the question or vote as helpful, but you cannot reply to this thread. json of my Node. /style/common in . js-like environment (uses Node. js core team. DO THIS: build and submit a batch job. Run apm install --check after installing to test compiling a native module. com Hello I am new to node red. 401733] ov5693 6-0036: Failed to allocate eeprom reg map: -22 [ 20. 0. That collided with Koçulu's Kik module, which is why the developer was asked to rename his software. Mention any other details that might be useful (optional) I am currently talking with @SanderElias and both agree this is a cli issue as I don’t have any external deps that use graceful-fs or node-localstorage I don't exactly how but react and react-dom were installed, next was not. 0 (node-v64 ABI, glibc) (falling back to source compile with node-gyp) This form is for bug reports and feature requests ONLY! The new nodejs package contains everything that these separate packages used to, because npm needs all the development files, and you’re not really using node these days if you’re not using npm. It was just a small fix, a few lines, and it seems that it won’t affect anything. 21. For Linux Users :-You have to give global permission first, add sudo at the beggining. Show output… Compiler tools not found Packages that depend on modules that contain C/C++ code will fail to install. I guess there is some problem with symlink, but not sure how to deal with it. You may need an appropriate loader to handle this file type, currently no loaders are configured to process this file. But when run on Linux it provides the following error: 'Error: libroll-parser. js file system (fs) module with features such as reading and writing JSON files. Your @kiuKisas: Hey Once I build this into an electron project, pack it with electron-builder, my users who install my app don't have to use windows-build-tools or even have python2 on linux and os x right ? If i build node-printer on windows 10, it's gonna be the same version for win7/8 ?Do I need to provide 32bits and 64bits versions too ? Or can I manage with a 32bits version only ? declare module '*. The result is to long to be included here. It turns out I had the same problem, with node-usb as a dependency of /noble (see my original post here). In the example above, the application is configured to omit the method variants using node-style async callback functions. 4 and [email protected] If the tsconfig. @babel/register uses Node's require() hook system to compile files on the fly when they are loaded. Progress] 98% after emitting web | For more information about signing of node configurations, see Improvements in WMF 5. js'. My Jenkins environment is not working properly but my local machine is working fine as i have python installed. The Visual Studio Code editor has built-in debugging support for the Node. So before importing a library's module, you need to install it with the pip command. . Node. Good luck. For example, npm test of the node-webkit's package would fail. I found an excellent implementation of XPath in the Blue Library, by Josh Harler. 10 install script 'node scripts/install. 0. But it says module 'typescript' not found, even when it is in package. 0 from node-sass v3. js in VS Code using the built-in debugger. When pasting it in use the </> button at the top of the forum text window. tsc -p <path to tsconfig. I was building for the web where nothing from the os module could run Hello all, I'm new to this group as well as NodeJS in general. js Loading http://localhost/APP/node_modules/primeng/components/fullcalendar/fullcalendar. I had the same problem today. Old deep dependencies couldn’t work with node. When trying to install Node-RED 0. #sudo apt-get -y install redis-server. Thus, it is not necessary to specify the module name. Module parse failed: Unexpected token. 0. Make sure the binary is stored at the specified path or debug it to check for problems with the binary or dependent . js server and keep it running? In this post, we will explore various ways to start an HTTP Node server. js and npm installed. js module that provides utilities to work with the operating system. I run the above command again and I've been able to go on with the tutorial till Install Polaris, when I restart the server I get this I am not familiar with the circleci/node image you are using. echo ". . Posted 10/8/18 2:02 PM, 2 messages In essence, it was caused by not having the –module AMD compiler flag. 1. rimraf: Use to recursively remove folders. js modules. #sudo npm install -g coffee-script. js, but will occur with any Node module (such as path, child_process, etc. However when I This thread is locked. Pastebin is a website where you can store text online for a set period of time. Not found. Just noticed one item in there-- The broken default node install. . Not sure. Unable to start Windows Service due to "Failed creating java jvm. . If the node. This documentation describes the built-in modules provided by Node. It’s always a good idea to update Homebrew before installing a Homebrew package, so run the following command to do that: Node-sass is a library that provides binding for Node. js Module not found: Can't resolve 'react-router-dom' in . If not I found the source code on the Apache site here. in your app routing module. In the example above, the application is configured to omit the method variants using node-style async callback functions. first open your file,and goto dependencies,next you delete bcrypt,my version "bcrypt": "^5. ) Failed to compile. js Module not found: You attempted to import /. If your production program is crashing so often that these disconnections are a problem, then the real problem is that the server is so buggy, not that it crashes in the case of a bug. /build/Release/bson'] code: 'MODULE_NOT_FOUND'} js-bson: Failed to load c ++ bson extension, using pure JS version ===== (You will see the same below log in the 'builderror. The precompiled whls from Christoph's page get around having to compile yourself but also include the missing packages, at least the one I downloaded did. Installing npm with Homebrew never seemed to work properly but I never knew why. After that when I am checking node -v v7. I only got a warning about xmlbuilder expecting an older version of node, but it seemed everything went fine, as there were no errors after that. The ESP8266 is a popular, low cost Wifi module with a full TCP/IP stack and microcontroller. js, will use Node's implementation of require and Node's search paths if the module is not found with the configuration used by RequireJS, so you can continue to use your existing Node-based modules without having to do changes to them. js, and also tried npm (analogous to yarn, which actually means yarn install, I used npm install). Thanks for your feedback! With your instructions using nvm, I have tried out different versions of node. js to LibSass, the C version of the popular stylesheet preprocessor, Sass. Can I use Node modules already written in the CommonJS module format? § 2 Yes! The Node adapter for RequireJS, called r. json file in the parent directory. All the errors are completely ignored. erlang file. js documentation for the exact behavior of this object. 4. You can load them into Node. 14 with the recommended procedure, installation fails with the following details: $ sudo npm install -g --unsafe&hellip; Error: Cannot find module '. js in a development environment. In short, in package. I tried several solutions mentioned in that thread but none of it worked in my case. js's CLI, only it will compile ES6 code before running it. It does not document modules provided by the community. BIFs can fail for various reasons. js project. If it appears to have succeeded then stop node red and start it in the terminal and post that log here too. right now, you can suppress those in the webpack config. Pastebin is a website where you can store text online for a set period of time. gyp and differs from project to project. 0, and it does not provide the ability to perform XPath queries. Before compiling a module, Node wraps the module code in a function, which we can inspect using the wrapper property of the Then, deploy the created node_modules folder as part of the application to Azure App Service. Import a node configuration in the Azure portal. js debugging in VS Code. It is responsible for finding the package, checking the version, and producing any needed messages. npm install --save react react-dom next . Installing Node. I have installed Cordova “successfully”. I am not that good with Linux so I am struggling. What you basically have then is an executable that behaves just like Node. Only users with topic management privileges can see it. org website, and for Mac they only have a 64-bit version of Node. node-gyp/6. 21 # Copy the native code in the src directory # If there is a header file copy/adapt it too $ cp ~/dev/terminal. The Node. When you first install serialport it will compile against the version of Node. org/dist/v0. Every time I try installing a package for Atom, I get the following message: Installing “[package name]” failed. 记一次Vue开发中遇到的问题,在src目录下新建style文件夹并在style文件夹中添加common. Also, the limitation on node12 is due to the CriticalCSS part, I'm not aware of Node 13 issue with node-sass, not sure what to do here. Either way you’ll have lots more info about what’s going on and can post the Just floating this to the top. Vue. js program itself is allowed to crash. 5. npm ERR! If you do, this is most likely a problem with the node-pty package, npm ERR! not with npm itself. When we define a variable in one module, the other modules in the program will not have access to that variable. js app. js module) for Electron, you can use electron-rebuild; more info at Electron's README. you include the flag /DELAYLOAD:node. - react-native-ui-kitten hot 1 [ViewPager] - Disable swipe gestures - react-native-ui-kitten hot 1 Ensure the output target is set to node to ensure that the code is compiled to work in a Node. The default value is web , and certain libraries, such as Axios , depend on this to determine which version of the code it should load up during compilation, and using the wrong code has some dire consequences, as I have come to discover. To resolve this open the file and save it as ‘hello. 1. 2 and [email protected] Nothing. js—and why not After installing NPM I executed make and got below errors, Can anybody please helpme? Hopefully came so far and at very end I am getting this error which I don’t Hello Experts, I am working on a POC on HANA XSA by creating a MTA project. js file. Every loaded module must be compiled into JavaScript code before being available in Node. npm ERR! Make sure you have the latest version of node. The CUDA driver API does not attempt to lazily allocate the resources needed by a module; if the memory for functions and data (constant and global) needed by the module cannot be allocated, cuModuleLoad() fails. js, will use Node's implementation of require and Node's search paths if the module is not found with the configuration used by RequireJS, so you can continue to use your existing Node-based modules without having to do changes to them. gitignore. In your Arduino IDE, type in the search box “ Adafruit Unified Sensor “, scroll all the way down to find the library and install it. h (f. ” Has your machine gone insane? The file is plainly there in the System32 folder. "baseUrl": ". After installing the library, restart your Arduino IDE and the code should compile without the error message. Can anyone help me with this? I am just getting started in MERN stack, I previously … Failed to compile. Now when you select the Run Build Task command or press (⇧⌘B (Windows, Linux Ctrl+Shift+B)), you are not prompted to select a task and your compilation starts. I would try creating a new app with expo init and verify that it works as expected. A Node. ttf) Cannot find module 'E:\node_modules pm\bin pm-cli. x, 12. js includes the child_process module, which has functions to create new processes. js: However, it does not readily compile in VC++ 6. Everything I see is geared to Linux fixes. exe but with a few extra modules already included. I think my issue is related to this issue. I want said "when i had push my ionic applicaiton with git " Ok, then this is an Ionic Pro thing: Ionic Pro is a hosted and closed source service, so there is not much we, the community, can help you with, sorry. . Linters provides warnings for suspicious looking code. js Try deleting and reinstalling your node modules rm -rf node_modules and then reinstalling, either npm install or yarn install if you're using yarn. Expected behavior Running the yarn encore dev compiles the JS and SCSS assets. Ask questions node-pre-gyp WARN Pre-built binaries not installable for [email protected] - feross, developer on the Video team at Yahoo. 1 - How to sign configuration and module. 10 install script 'node scripts/install. cc # Correct the export name of the module # Add the node_ prefix to the node_module name # Last line should read - NODE_MODULE(node_pty, init) # add node_pty to src/node_extensions. 16 was ok (on macOS Catalina and on Ubuntu 18. so: cannot open shared object file: No such file or directory" with a less than helpful stack trace. This directory is empty, so it's a good place to keep your source code that you want to compile. 3 (node-v64 ABI, unknown) (falling back to source compile with node-gyp) webpack is a module bundler. While this might fix the issue, it might also break something as stream refers to a node. I also use this approach when I work with debug module or setting the Node. pymssql¶. import { LoginPageModule } from '. 10? Pre-built binaries not found for [email protected] The local script at path will be transferred to the remote node and then executed. It is generally not a sign of any problem. Plugin starts every 60 seconds (1 minute), because we need data fixation to be performed one time in a minute. Your RX node or your databasewill have to deal with this. login1$ matlab; Do not launch too many simultaneous processes; while it's fine to compile on a login node, a command like "make -j 16" (which compiles on 16 cores) may impact other users. x branch of pymssql is built on the latest release of FreeTDS which removes many of the limitations found with older FreeTDS versions and the 1. js Module not found: Can 't resolve ' antd / dist ' in ' G: \ * * * \src' 我是跟着视频敲得代码啊. Module parse failed: Unexpected character ' ' (1:0) You may need an appropriate loader to handle thi; Vue--Module parse failed: Unexpected character '' (1:0) (fonts/element-icons. --inspect), use them with node -r ts-node/register instead of the ts-node CLI. js API correctly, although it is well hidden and not given the shout out it deserves. Also, it seems that sourcemaps are not working with AMD modules, so you will need to remove this flag from the compile options. /src/App. exe. If you link against the wrong node. sh". x. npm-run-all: Use to execute multiple npm scripts sequentially or in parallel. Aside from dealing with long-running tasks, this module can also interface with the OS and run shell commands. Description. I looked at the nodejs. ) This topic has been deleted. ) if your project is not properly npm install node-red-contrib-telnet-client. But now we need to get the package on the VPS. / or . namespace SL_Project2 The specified module could not be found. While this is quite helpful overall, it means that there can be confusing cases where code within a require() hook causes more calls to require , causing a dependency cycle. js is a simple or complex functionality organized in single or multiple JavaScript files which can be reused throughout the Node. Linters. 2 and [email protected] raw module. js behave as a file server. tip. js sh: 1: webpack: not found npm ERR! file sh npm ERR! code ELIFECYCLE npm ERR! errno ENOENT npm ERR! syscall spawn npm ERR! [email protected] One thing I’d try (and I say this as a non-Node user) is starting from a simpler image and installing Node myself. arch and process. Setup is easy and there is a Node. Expected behavior: Expected to load the imported components and run without crashing (currently I am just testing with primary button component. There are several reasons why this might do you happen to know where to look for that specific message “command not found” in centos? I’d like to chnage it to something else but am not able to locate it anywhere… have found it in other distros like ubuntu/debian – they have it in /etc/bash. Perhaps things will be clear when we can see how you are installing Node. i found the solution. Read here for instructions on installing Python and Visual Studio. OS: Undefined ssh session logs recorded are blank or unable to view the ssh logs recorded though there is listing of the ssh sessions that is in progress. When i Install the older version of the node-red-node-serialport node it works fine. e. Since react-dom/server does not use refs the init-cm function will never be called anyways. 6 on macOS 10. js to run shell commands to structure and maintain their operations as a Node. If not found in the current directory, it will search for the tsconfig. Creating and starting a server is easy with Node. tar. Now it is complaining that the file mod_xml2enc. gz. js includes the child_process module, which has functions to create new processes. js debugging. Save the code above in a file called "demo_module. If you do provide asyncOptions, be aware that this module will not generate method variants of a given flavor if you don't provide a string value for the corresponding suffix (asyncSuffix, syncSuffix, promiseSuffix). js CLI arguments (e. 3 Many thanks. 7 (electron-v1. You should install @babel/node and @babel/core first before npx babel-node, otherwise npx will install out-of-dated legacy babel-node 6. sh". dll" "The specified module could not be found" Unable to start Windows Service due to "Failed The Node. Sorry about that generally topic, but i do not really know how to ask. 211995] vi vi: subdev ov5693 6-0036 bound [email protected]:~$ lsmod Module Size Used by bnep 14552 2 bcmdhd 7465122 0 cfg80211 449659 1 bcmdhd ov5693 25496 1 bluedroid_pm 11204 0 [email protected]:~$ sudo rmmod ov5693 [sudo] password for ubuntu: rmmod: ERROR: Module Unable to deploy Heroku server (Push rejected, failed to compile Node. js Foundation has consolidated all the best thinking around why enterprises should consider Node. js Get useful tips & free resources directly to your inbox along with exclusive subscriber-only content. This header file contains C++ wrapper classes for N-API and it is officially maintained along with Start/stop it using the following commands:" echo ". 0 gyp ERR! not ok Build failed with Method not found Unanswered Full compile of the application, then full CIL appeared to fix this issue - however I point out that the full compile of the application yielded no errors - strange system AX. GitHub is home to over 50 million developers working together to host and review code, manage projects, and build To your horror you receive the error “RegSvr32 The module some. However, Josh implemented Medium The easiest way to install node. js", and initiate the file: Initiate demo_module. No errors. I had a similar problem in a project using Webpack, Electron, and Angular. / to locate the module, that means that the module is located in the same folder as the Node. Debug Node. Module build failed: Error: Plugin/Preset files are not allowed to export objects, only functions. Delta compression using up Home » Nodejs » Push rejected, failed to compile Node. babel comes with a second CLI which works exactly the same as Node. /main or Main folder should contain the index. Visit the “Using Node modules” article in the node-webkit's wiki for more details. 24. 6 事象 gulpが無いと言われたのでインスコへ $ npm I am trying to compile files in my scss folder to regular css files but it's hanged in between. js. js. Actual behavior Running webpack ERROR Failed to compile with 1 errors This is not the case in Node. See the Node. npm -v-bash: npm: command not found. 0 start: webpack && node build/gateway. js/src/unix/pty. js ry ( nodejs Founder ) React Rust tensorflow Spring Boot golang Ask questions Scss not able to compile but able to compile sass Module version latest Hi, I’m installing on Debian 9 minimal server I’m in the step of running npm to configure the gateway [email protected]:~/gateway# npm start [email protected] Solution: Stick with recommended Node 10 LTS version. 2. Module in Node. Y] Compile for usage in a Node. js 解决办法: build目录下的web DO NOT DO THIS: Run Matlab or other software packages on a login node. when using sass imports yarn create react- app test yarn add node-sass Rename index. js to run shell commands to structure and maintain their operations as a Node. 1. So we figured we’d just simplify things with the single package. ts file-extension. less文件保存后,在main. . Exit status 1 npm ERR! npm ERR! Failed at the [email protected] js中使用 import ‘. Analyzer is unconfigurable, that is why it doesn’t require any configuration file and it doesn’t contain set_config method. 0" [ERROR] gyp WARN EACCES attempting to reinstall using temporary dev dir "/home/bdsiwb_2018/incubator Network and system failure are a reality, whether or not the Node. Clean install, node from source, working great. js's built-in http A physical network node is an electronic device that is attached to a network, and is capable of creating, receiving, or transmitting information over a communication channel. The compilation step is done via the _compile function of the loaded module. We use the tool 'wget' to download it: wget http://nodejs. 0-ce-git and things have been plain sailing for me. Node. Using node-addon-api module. 15/node-v0. 1. js modules. js. 2: The platform "linux" is incompatible with this module. 2. lib you will get load-time errors when you require the module in Electron. On the State configuration (DSC) page, click on the Configurations tab, then That got rid of the command not found error, I have this module stored in \users\jspatton\documents\windows powershell\modules and i'm getting this when I attempt to compile the mof PSDesiredStateConfiguration\Node : The term 'cAccessControlEntry' is not recognized as the name of a cmdlet, function, script file, or operable program. js module instead of shell scripts. Thanks Some of the packages are either proprietary or are still in beta and thus, are not available through the standard install method. npm ERR! Tell the author that this fails on your system I found the issue and fixed with this thread. Attachments (there is always a "but :)) I can't install "node-red-node-sqlite" from the command line or from the web: 16 Apr 16:48:30 - [info] Installing module: node-red-node-sqlite, version: 0. npm install just wouldn't cut it. /genieacs-stop. 8. Now we know how to parse the query string, and in the previous chapter we learned how to make Node. js environment. js file. Launch a REPL (Read-Eval-Print-Loop). They appium/appium-ios-deviceの導入でつまづいた内容のまとめです。 環境 MacBookPro15 Mojave - macOS 10. If file size is not found in data dictionary, then plugin just ends. It also indicates which methods are available for different versions of Node. npm install --save-dev electron-rebuild This module aims to implement XSLT in Perl, so as long as you have XML::Parser working you won't need to compile anything to install it. The 2. Each module in Node. dll failed to load. extensions , and it uses the same code as register . Node. Gyp compiles native code to a nodejs module. 05. js module, under engines "node": "10. Options: true: Provide a polyfill. A simple database interface for Python that builds on top of FreeTDS to provide a Python DB-API interface to Microsoft SQL Server. lock file, I found this: As for import React, { Component } from 'react', this does not start with a . Module build failed: Error: Plugin/Preset files are not allowed to export objects, only functions. JOIN OUR MAILING LIST NOW Attachments: Up to 5 attachments (including images) can be used with a maximum of 1. In this Node. 2. js CORS package suddenly stopped working; Eduardo on cannot compile and find module angular/animations; Andy on Test failed but keep the grunt process alive you link against node. So when we run the Node hello. Node. json. js application, you will need to install the Node. For instructions for building sqlcipher see Building SQLCipher for node. 2 MB total. svg and defining the module's content as any. js runtime and can debug JavaScript, TypeScript, and many other languages that are transpiled into JavaScript. if not work,you delete your node js sudo apt-get remove nodejs and sudo apt-get purge nodejs and sudo apt-get autoremove,and do the above. The webpack demo (in the demos/webpack subdirectory of the git repo) has the following Failed to load resource: the server responded with a status of 404 (Not Found) errors. 怎么我这里就出错了呢 ? ? ? 于是. h header file. js ecosystem, and is primarily used to install and manage external modules in a Node. Compiling Python to JavaScript using Transcrypt was a chore - the generated code uses module imports, which require some workarounds in Node. x branch. js Module. To run node-sqlite3 against sqlcipher you need to compile from source by passing build options like: Yes, as I mentioned previously, this is expected behaviour. It allows you to natively compile . 16. Its main purpose is to bundle JavaScript files for usage in a browser, yet it is also capable of transforming, bundling, or packaging just about any resource or asset. . I found that when we open the file in any text editor and save it ‘hello. 0 and [email protected] components/AddTodo which falls outside of the project src/ directory. js File Server. Just in case your ninja search skills have failed you, the official documentation does have an example on how to use the Node. 3 16 Apr 16:48:47 - [warn] Installation of module node-red-node-sqlite failed: 16 Apr 16:48:47 - [warn] ----- 16 Apr 16:48:47 It should compile successfully. 0, the node option may be set to false to completely turn off the NodeStuffPlugin plugin. DLL files. This module is also supported for Windows targets. 2" instead of "3. js to deploy a smart contract. 20. 无 果. Note, however, that most likely you will not be able to simply compile your favorite TypeScript library to WebAssembly, as it probably makes use of either browser or NodeJS features, which will not be available in the WebAssembly runtime without the necessary module imports. js files. js . Also, do I need to install python on the Mac to install vcremote? node-pre-gyp ERR! Pre-built binaries not found for [email protected] js it can’t recognise as java script file. While using 'global' command, I've encountered "MathScript Node Failed To Compile Error" from the first time I tried it. Push rejected, failed to compile Node. If you think it’s not the most appropriate model for compiling, don’t hesitate to let me know! I’ve tried by all means to solve the problem with software, but without success. try this way of importing. js module instead of shell scripts. 0 (node-v64 ABI) (falling back to source compile with node-gyp) Essentially, the instant-messaging biz says it was going to publish some open-source code including an NPM module also named Kik. readFileSync is not a function. ` when using sass imports , Build hangs after Failed to compile. 95% emitting ERROR Failed to compile with 1 errors7:22:10 AM I was not alone, many people ran into similar issues. 出错图示: 解决办法: 在对应文件夹下的cmd命令控制窗口输入 npm install -S react-router-dom Note: If you need to use advanced node. js require to load Hello World with a Node. 4. Now I still don't but have them installed :) I had to use SGD1953's tip and do "sudo rm -rf ~/. – Mayank Shukla Feb 13 '18 at 12:51 I've a folder called "Main" and a file calles "main. 1 build script. To recompile serialport (or any native Node. js'. json with browsers at F:\WEB\HBuilder\app\travelApp\node_modules\browserslist\node. c ". I started a new project, and wanted to play around with the Destiny 2 API. System administrators can use Node. I have a heatpump system with an USB-Interface which sends and receives simple Strings like "13 1234" Want ro read/write this strings. Main is a folder not file, so either it should be . 10. and if, at the end, it says it has failed then copy/paste the output here please. If you do provide asyncOptions, be aware that this module will not generate method variants of a given flavor if you don't provide a string value for the corresponding suffix (asyncSuffix, syncSuffix, promiseSuffix). If you are using a module which needs global variables in it, use ProvidePlugin instead of global. js runtime on your machine. 95% emitting ERROR Failed to compile with 1 errors7:22:10 AM I have Labview 2009 SP1 with Mathscript Module. json file is not found in the root directory, then you can specify the path using the --project or -p option, as shown below. js applications in VS Code can be found in the Node. I am trying to install ionic on windows 10, using npm. I had detected the problem from the logs, and it was related to an internal dependency that is node-gyp v3. /style/common’ 导入,终端打印错误信息: This relative module was not found: * . /genieacs-start. 0 But when checking I am getting this. 0 MB each and 5. sudo npm i node-sass. Think of a box but the whole box is only one side. json in the . Auto-imported BIFs are listed without module prefix. The callback takes two parameters: an object representing the module being loaded and its path. You can the some logo on the file like “S”. We followed instructions from NodeJS: Due to technical limitations ES6-style module-loading is not fully supported in a babel-node REPL. For a more detail understanding, it can be read here. builtin. npm ERR! A complete log of this run can be found in: npm ERR! C:\Users\Irene\AppData\Roaming pm-cache\_logs\2019-04-21T15_52_07_208Z-debug. js debugging tutorial to help you. log') C:\ >node-gyp configure --msvs _version=2010 gyp info it worked if it ends with ok gyp info using [email protected] js available. js/node_modules/pty. 每天一点点之vue框架开发 - vue坑-This relative module was not found - 我若亦如风 - 博客园 + ProjectWise integration module for Revit [50000] Failed to compile a moniker from given string. #BlackLivesMatter New security releases now available for 15. --fail-at-end - if a particular module build fails, continue the rest of the reactor and report all failed modules at the end instead --non-recursive - do not use a reactor build, even if the current project declares modules and just build the project in the current directory Notice that we use . Takes a filename fname and loads the corresponding module module into the current context. js using the require() function and use them as if they were ordinary Node. 6. I am using a windows 10 64-bit computer. See full list on npmjs. In this tutorial we are using the ESP8266-01 module along with the Arduino UNO. exe link is not delayed, then the delay-load hook won't get a chance to fire and the node symbols won't be correctly resolved. npm ERR! Tell the author that this fails on your system This namespace will compile fine for both builds (:node-script and :browser) but when trying to run the :node-script it will fail since the codemirror package tries to access the DOM. 2" is an optional dependency and failed compatibility check. 12. /login/login. Try `pip3. This is runned on a localhost, node server. js runtime bundled with Electron. To retrieve the node information in xml format, you should set the ContentType to ”application/xml”. ts:35 ERROR Error: Uncaught (in promise): Error: Fetch error: 404 Not Found Instantiating http://localhost/APP/typescript Loading typescript Unable to load transpiler to transpile http://localhost/APP/node_modules/@fullcalendar/core/main. c is not found. js Well I'm still not sure entirely what you mean but you could create a single bundle of Node with a set of dependencies that you need, then let it execute process. Exit fullscreen mode. 2" Failed to compile . Ismael on How to omit subfolders from node_modules for ngx-extended-pdf-viewer; cwarford on Angular: ngOnInit hook does not works in dynamically created component; Pepe on node. js addons are shared objects written in C++ that are dynamically linked. Apache httpd uses libtool and autoconf to create a build environment that looks like many other Open Source projects. 5. / or / therefore node will start looking for the module in the node_modules in a specific order till react is found. 2 and [email protected] webpack is a module bundler. js guide, I’ll discuss not only how these advantages are accomplished, but also why you might want to use Node. This message is generated if a block of data is partially written. ). A passive distribution point such as a distribution frame or patch panel is consequently not a node. 6. cc src/node_pty. For information about where to find these logs, see Where are the DSC Event Logs. boolean. I'm assuming that you have that file so hopefully it will work for you. . js tutorial node-pre-gyp WARN Pre-built binaries not installable for [email protected] It provides the interaction between users and your application. [ERROR_MOD_NOT_FOUND (0x7E)] The cluster node failed to take control of the quorum resource because the resource is owned If the file is found, it is read and processed by CMake. js applications. node. Building for sqlcipher. Compile for Electron for renderer process, providing a target using NodeTemplatePlugin with asyncChunkLoading set to true, FunctionModulePlugin for browser environments and NodeTargetPlugin and ExternalsPlugin for CommonJS and Electron built-in modules. Many find-modules provide limited or no support for versioning; check the module documentation. g. #sudo add-apt-repository -y ppa:chris-lea/redis-server. Hope this The problem was in deep dependencies which didn’t update during simple git dokku pushing. RuntimeError: Running cythonize failed! How to fix No module named Cython. For Windows users, press the start button and look for "Command Prompt", or simply write "cmd" in the search field. Although it's not really "broken", just not the node you're wanting. 0 gyp ERR! node-gyp -v v3. You can use WebAssembly to create a node_module, but all Node. Now that the package is on your VPS, extract it from the tar file. Note: The packages on this page are maintained and supported by their respective packagers, not the Node. Hello. We could be more explicit about it being a url by defining the type as string. I've recently upgraded to the latest version of the expo cli, and when I run expo init and select the blank TypeScript template, when I cd into the directory it creates and run yarn start. Have a look a the modifications to the project file for the correct syntax. Then compare the new app with your real app to see what the differences are. txt’. 0. npm ERR! If you do, this is most likely a problem with the node-pty package, npm ERR! not with npm itself. The xDscDiagnostics module can assist you in parsing detailed information from the DSC logs. So how come variables in Node are magically scoped? The answer is simple. This is my output Write-Host “node information was not retrieved. . To see how it works, you can check the Node. Despite it being in the /. Relative imports outside of src/ are not supported. 14. 0. Anyway, that’s what I’ve been doing since the beginning, and it works. JS side project when I encountered a build error: If your configuration compiles successfully, but fails when applied to a node, you can find detailed information in the DSC logs. It makes frontend development fun again! That's why we used it to build Yahoo's new HTML5 video player. js" – cmyk Feb 13 '18 at 12:53 Failed to compile. Its main purpose is to bundle JavaScript files for usage in a browser, yet it is also capable of transforming, bundling, or packaging just about any resource or asset. Posted 6/21/17 10:57 PM, 6 messages I guess I can compile my projects with the DoIt ESP32 DevKit v1 model. Hey Yi, thanks for noting that I'll have to test if the built-in handling of the laravel-mix wouldn't cause any drawbacks . /src/main. No content. However, any help will be highly appreciated. 2 ABI) (falling back to source compile with node-gyp) 2-win32-x64\\node_sqlite3 94% asset optimization ERROR Failed to compile with 1 errors This relative module was not found: * . The text was updated successfully, but these errors were encountered: 👍 1 3. js and npm installed. If you continue to browse, then you agree to our privacy policy and cookie policy. Since webpack 3. 04). Not found. js has its own context, so it cannot interfere with other modules or pollute global scope. BIFs listed with module prefix are not auto-imported. com is the number one paste tool since 2002. X and increase version of xsjs-test "@sap/xsjs-test": "^3. I ran out of time and so I haven't played further but hopefully that will get you over the line. module'; const routes: Routes = [ { path: 'login', loadChildren : ()=>LoginPageModule }, ]; LoginPageModule above is the class name and /login/login. Occasionally a site user or developer will navigate to a page and suddenly the page content disappears, and it becomes blank. GitHub Gist: instantly share code, notes, and snippets. This allows the TypeScript compiler to act as the intermediary between your TypeScript source code and the Node. components/AddTodo. js 3, 4 and 5. 0 and npm and addressing the memory issues, I was able to compile vscode easily but not quickly. argv[2] or start a REPL if none is provided. Hope this works for you too! Ask questions Cannot find module '/snapshot/<My project>/node_modules /mapnik If you don't want to compile the package/file into executable and want to 'require This way your git repo is not bogged down with node libs. json. /src", "paths": { "@modules/*": ["rest/modules/*"], "@services/*": ["services/*"] } Enter fullscreen mode. /src/components/App/App. x release lines This tutorial will show you how to use FRED — a cloud-based Node-RED — to control and read data from Arduino boards using an ESP8266 module and the STS-MQTT platform. All batch jobs run on the compute nodes. The core compiler however, does not depend on Node, and can be run in any JavaScript environment, or in the browser (see Try CoffeeScript). json> docker compose up コマンドを実行した際以下のようなエラーが出てしまい、localhost:8080にアクセスできません。 どうやらsrcファイルのmain. log To Reproduce cd /opt. As we know, Koçulu refused, and that led to Tuesday's cluster-fsck. node failed to compile module not found


Node failed to compile module not found